UHD build error in gnuradio next branch

Hi,
FYI, I just briefly tried doing a git pull and build for the gnu
radio next branch, and it stopped with a build error yesterday.

uhd_simple_source.cc: In member function ‘virtual uhd::tune_result_t
uhd_simple_source_impl::set_center_freq(double)’:
uhd_simple_source.cc:65: error: ‘class uhd::usrp::simple_usrp’ has no
member named ‘get_rx_freq’
make[3]: *** [uhd_simple_source.lo] Error 1
make[3]: *** Waiting for unfinished jobs…
uhd_mimo_source.cc: In member function ‘virtual uhd::tune_result_t
uhd_mimo_source_impl::set_center_freq(size_t, double)’:
uhd_mimo_source.cc:67: error: ‘class uhd::usrp::mimo_usrp’ has no member
named ‘get_rx_freq’
make[3]: *** [uhd_mimo_source.lo] Error 1
uhd_mimo_sink.cc: In member function ‘virtual uhd::tune_result_t
uhd_mimo_sink_impl::set_center_freq(size_t, double)’:
uhd_mimo_sink.cc:67: error: ‘class uhd::usrp::mimo_usrp’ has no member
named ‘get_tx_freq’
make[3]: *** [uhd_mimo_sink.lo] Error 1
uhd_simple_sink.cc: In member function ‘virtual uhd::tune_result_t
uhd_simple_sink_impl::set_center_freq(double)’:
uhd_simple_sink.cc:64: error: ‘class uhd::usrp::simple_usrp’ has no
member named ‘get_tx_freq’
make[3]: *** [uhd_simple_sink.lo] Error 1
mv -f .deps/utils.Tpo .deps/utils.Plo
make[3]: Leaving directory /tool/gnuradio/gr-uhd/lib' make[2]: *** [all-recursive] Error 1 make[2]: Leaving directory/tool/gnuradio/gr-uhd’
make[1]: *** [all-recursive] Error 1
make[1]: Leaving directory `/tool/gnuradio’
make: *** [all] Error 2

Best regards,

Elvis D.

order of dependencies mate

install the uhd libraries and headers first

-Josh

This forum is not affiliated to the Ruby language, Ruby on Rails framework, nor any Ruby applications discussed here.

| Privacy Policy | Terms of Service | Remote Ruby Jobs