Trouble building mod_ruby

Hi,

I just downloaded mod_ruby-1.2.6 for my Apache 2.2 server running on
Fedora Core 6 Linux. I ran ./configure.rb without problems, but when
I run make, I get the below errors. It seems to be complaining about
files not being found. Where do I find these most sacred files?

Thanks, - Dave

gcc -g -O2 -fPIC -Wall -O2 -g -pipe -Wall -Wp,-D_FORTIFY_SOURCE=2 -
fexceptions -fstack-protector --param=ssp-buffer-size=4 -m32 -
march=i386 -mtune=generic -fasynchronous-unwind-tables -DLINUX=2 -
D_REENTRANT -D_GNU_SOURCE -D_LARGEFILE64_SOURCE -pthread -I. -I/usr/
local/lib/ruby/1.8/i686-linux -I/usr/include/httpd -c mod_ruby.c
In file included from /usr/include/httpd/httpd.h:43,
from mod_ruby.h:52,
from mod_ruby.c:33:
/usr/include/httpd/ap_config.h:25:17: error: apr.h: No such file or
directory
/usr/include/httpd/ap_config.h:26:23: error: apr_hooks.h: No such file
or directory
/usr/include/httpd/ap_config.h:27:32: error: apr_optional_hooks.h: No
such file or directory
In file included from /usr/include/httpd/httpd.h:46,
from mod_ruby.h:52,
from mod_ruby.c:33:
/usr/include/httpd/ap_release.h:24:41: error: apr_general.h: No such
file or directory
In file included from mod_ruby.h:52,
from mod_ruby.c:33:
/usr/include/httpd/httpd.h:50:24: error: apr_tables.h: No such file or
directory
/usr/include/httpd/httpd.h:51:23: error: apr_pools.h: No such file or
directory
/usr/include/httpd/httpd.h:52:22: error: apr_time.h: No such file or
directory
/usr/include/httpd/httpd.h:53:28: error: apr_network_io.h: No such
file or directory
/usr/include/httpd/httpd.h:54:25: error: apr_buckets.h: No such file
or directory
/usr/include/httpd/httpd.h:55:22: error: apr_poll.h: No such file or
directory
In file included from /usr/include/httpd/httpd.h:59,
from mod_ruby.h:52,
from mod_ruby.c:33:
/usr/include/httpd/ap_regex.h:87: error: expected specifier-qualifier-
list before âEURO~apr_size_tâEURO™
/usr/include/httpd/ap_regex.h:118: error: expected declaration
specifiers or âEURO~…âEURO™ before âEURO~apr_size_tâEURO™
/usr/include/httpd/ap_regex.h:127: error: expected âEURO~=âEURO™,
âEURO~,âEURO™, â
EURO~;âEURO™, âEURO~asmâEURO™ or âEURO~__attribute__âEURO™ before
âEURO~ap_regerrorâEURO™
In file included from mod_ruby.h:52,
from mod_ruby.c:33:
/usr/include/httpd/httpd.h:433: error: expected âEURO~)âEURO™ before
âEURO~*âEURO™
token
/usr/include/httpd/httpd.h:601: error: expected specifier-qualifier-
list before âEURO~apr_int64_tâEURO™
/usr/include/httpd/httpd.h:723:21: error: apr_uri.h: No such file or
directory
/usr/include/httpd/httpd.h:730: error: expected specifier-qualifier-
list before âEURO~apr_pool_tâEURO™
/usr/include/httpd/httpd.h:746: error: expected specifier-qualifier-
list before âEURO~apr_pool_tâEURO™
/usr/include/httpd/httpd.h:1008: error: expected specifier-qualifier-
list before âEURO~apr_pool_tâEURO™
/usr/include/httpd/httpd.h:1085: error: expected specifier-qualifier-
list before âEURO~APR_RING_ENTRYâEURO™
/usr/include/httpd/httpd.h:1118: error: expected specifier-qualifier-
list before âEURO~apr_sockaddr_tâEURO™
/usr/include/httpd/httpd.h:1146: error: expected specifier-qualifier-
list before âEURO~apr_port_tâEURO™
/usr/include/httpd/httpd.h:1199: error: expected specifier-qualifier-
list before âEURO~apr_bucket_brigadeâEURO™
/usr/include/httpd/httpd.h:1207: error: expected specifier-qualifier-
list before âEURO~apr_bucket_brigadeâEURO™
/usr/include/httpd/httpd.h:1213: error: expected specifier-qualifier-
list before âEURO~apr_socket_tâEURO™
/usr/include/httpd/httpd.h:1229: error: expected âEURO~)âEURO™ before
âEURO~*â
EURO™ token
/usr/include/httpd/httpd.h:1239: error: expected âEURO~)âEURO™ before
âEURO~*â
EURO™ token
/usr/include/httpd/httpd.h:1252: error: expected âEURO~)âEURO™ before
âEURO~*â
EURO™ token
/usr/include/httpd/httpd.h:1262: error: expected âEURO~)âEURO™ before
âEURO~*â
EURO™ token
/usr/include/httpd/httpd.h:1271: error: expected âEURO~)âEURO™ before
âEURO~*â
EURO™ token
/usr/include/httpd/httpd.h:1281: error: expected âEURO~)âEURO™ before
âEURO~*â
EURO™ token
/usr/include/httpd/httpd.h:1291: error: expected âEURO~)âEURO™ before
âEURO~*â
EURO™ token
/usr/include/httpd/httpd.h:1303: error: expected âEURO~)âEURO™ before
âEURO~*â
EURO™ token
/usr/include/httpd/httpd.h:1311: error: expected âEURO~)âEURO™ before
âEURO~*â
EURO™ token
/usr/include/httpd/httpd.h:1320: error: expected âEURO~)âEURO™ before
âEURO~*â
EURO™ token
/usr/include/httpd/httpd.h:1331: error: expected âEURO~)âEURO™ before
âEURO~*â
EURO™ token
/usr/include/httpd/httpd.h:1354: error: expected âEURO~)âEURO™ before
âEURO~*â
EURO™ token
/usr/include/httpd/httpd.h:1364: error: expected âEURO~)âEURO™ before
âEURO~*â
EURO™ token
/usr/include/httpd/httpd.h:1376: error: expected âEURO~)âEURO™ before
âEURO~*â
EURO™ token
/usr/include/httpd/httpd.h:1385: error: expected âEURO~)âEURO™ before
âEURO~*â
EURO™ token
/usr/include/httpd/httpd.h:1394: error: expected âEURO~)âEURO™ before
âEURO~*â
EURO™ token
/usr/include/httpd/httpd.h:1436: error: expected âEURO~)âEURO™ before
âEURO~*â
EURO™ token
/usr/include/httpd/httpd.h:1446: error: expected âEURO~)âEURO™ before
âEURO~*â
EURO™ token
/usr/include/httpd/httpd.h:1457: error: expected âEURO~)âEURO™ before
âEURO~*â
EURO™ token
/usr/include/httpd/httpd.h:1465: error: expected âEURO~)âEURO™ before
âEURO~*â
EURO™ token
/usr/include/httpd/httpd.h:1474: error: expected âEURO~=âEURO™,
âEURO~,âEURO™, â
EURO~;âEURO™, âEURO~asmâEURO™ or âEURO~__attribute__âEURO™ before â
EURO~ap_escape_errorlog_itemâEURO™
/usr/include/httpd/httpd.h:1485: error: expected âEURO~)âEURO™ before
âEURO~*â
EURO™ token
/usr/include/httpd/httpd.h:1494: error: expected âEURO~)âEURO™ before
âEURO~*â
EURO™ token
/usr/include/httpd/httpd.h:1523: error: expected âEURO~)âEURO™ before
âEURO~*â
EURO™ token
/usr/include/httpd/httpd.h:1537: error: expected âEURO~)âEURO™ before
âEURO~*â
EURO™ token
/usr/include/httpd/httpd.h:1547: error: expected âEURO~)âEURO™ before
âEURO~*â
EURO™ token
/usr/include/httpd/httpd.h:1599: error: expected âEURO~)âEURO™ before
âEURO~*â
EURO™ token
/usr/include/httpd/httpd.h:1607: error: expected âEURO~)âEURO™ before
âEURO~*â
EURO™ token
/usr/include/httpd/httpd.h:1621: error: expected âEURO~)âEURO™ before
âEURO~*â
EURO™ token
/usr/include/httpd/httpd.h:1629: error: expected âEURO~)âEURO™ before
âEURO~*â
EURO™ token
/usr/include/httpd/httpd.h:1642: error: expected âEURO~)âEURO™ before
âEURO~*â
EURO™ token
/usr/include/httpd/httpd.h:1682: error: expected âEURO~)âEURO™ before
âEURO~*â
EURO™ token
/usr/include/httpd/httpd.h:1694: error: expected âEURO~)âEURO™ before
âEURO~*â
EURO™ token
/usr/include/httpd/httpd.h:1704: error: expected âEURO~)âEURO™ before
âEURO~*â
EURO™ token
/usr/include/httpd/httpd.h:1712: error: expected âEURO~)âEURO™ before
âEURO~*â
EURO™ token
/usr/include/httpd/httpd.h:1723: error: expected âEURO~)âEURO™ before
âEURO~*â
EURO™ token
In file included from mod_ruby.h:53,
from mod_ruby.c:33:
/usr/include/httpd/http_config.h:279: error: expected specifier-
qualifier-list before âEURO~apr_int64_tâEURO™
/usr/include/httpd/http_config.h:357: error: expected âEURO~)âEURO™
before â
EURO~*âEURO™ token
/usr/include/httpd/http_config.h:365: error: expected âEURO~;âEURO™
before â
EURO~voidâEURO™
/usr/include/httpd/http_config.h:557: error: expected âEURO~)âEURO™
before â
EURO~*âEURO™ token
/usr/include/httpd/http_config.h:566: error: expected declaration
specifiers or âEURO~…âEURO™ before âEURO~apr_pool_tâEURO™
/usr/include/httpd/http_config.h:582: error: expected declaration
specifiers or âEURO~…âEURO™ before âEURO~apr_pool_tâEURO™
/usr/include/httpd/http_config.h:607: error: expected âEURO~=âEURO™,
âEURO~,â
EURO™, âEURO~;âEURO™, âEURO~asmâEURO™ or âEURO~__attribute__âEURO™
before â
EURO~ap_pcfg_openfileâEURO™
/usr/include/httpd/http_config.h:619: error: expected âEURO~)âEURO™
before â
EURO~*âEURO™ token
/usr/include/httpd/http_config.h:669: error: expected âEURO~)âEURO™
before â
EURO~*âEURO™ token
/usr/include/httpd/http_config.h:685: error: expected declaration
specifiers or âEURO~…âEURO™ before âEURO~apr_pool_tâEURO™
/usr/include/httpd/http_config.h:686: error: expected declaration
specifiers or âEURO~…âEURO™ before âEURO~apr_pool_tâEURO™
/usr/include/httpd/http_config.h:975: error: expected âEURO~)âEURO™
before â
EURO~intâEURO™
In file included from mod_ruby.h:54,
from mod_ruby.c:33:
/usr/include/httpd/http_core.h:30:22: error: apr_hash.h: No such file
or directory
/usr/include/httpd/http_core.h:31:26: error: apr_optional.h: No such
file or directory
In file included from /usr/include/httpd/http_core.h:32,
from mod_ruby.h:54,
from mod_ruby.c:33:
/usr/include/httpd/util_filter.h:72: warning: data definition has no
type or storage class
/usr/include/httpd/util_filter.h:72: warning: type defaults to âEURO~intâ
EURO™ in declaration of âEURO~ap_input_mode_tâEURO™
/usr/include/httpd/util_filter.h:136: error: expected declaration
specifiers or âEURO~…âEURO™ before âEURO~*âEURO™ token
/usr/include/httpd/util_filter.h:137: error: expected declaration
specifiers or âEURO~…âEURO™ before âEURO~apr_bucket_brigadeâEURO™
/usr/include/httpd/util_filter.h:137: warning: type defaults to âEURO~intâ
EURO™ in declaration of âEURO~apr_status_tâEURO™
/usr/include/httpd/util_filter.h:137: error: âEURO~apr_status_tâEURO™
declared as function returning a function
/usr/include/httpd/util_filter.h:139: error: expected declaration
specifiers or âEURO~…âEURO™ before âEURO~apr_bucket_brigadeâEURO™
/usr/include/httpd/util_filter.h:140: error: expected declaration
specifiers or âEURO~…âEURO™ before âEURO~ap_input_mode_tâEURO™
/usr/include/httpd/util_filter.h:141: error: expected declaration
specifiers or âEURO~…âEURO™ before âEURO~apr_read_type_eâEURO™
/usr/include/httpd/util_filter.h:142: error: expected declaration
specifiers or âEURO~…âEURO™ before âEURO~apr_off_tâEURO™
/usr/include/httpd/util_filter.h:142: error:
âEURO~ap_in_filter_funcâEURO™
declared as function returning a function
/usr/include/httpd/util_filter.h:146: error: expected specifier-
qualifier-list before âEURO~ap_out_filter_funcâEURO™
/usr/include/httpd/util_filter.h:296: error: expected declaration
specifiers or âEURO~…âEURO™ before âEURO~apr_bucket_brigadeâEURO™
/usr/include/httpd/util_filter.h:297: error: expected declaration
specifiers or âEURO~…âEURO™ before âEURO~ap_input_mode_tâEURO™
/usr/include/httpd/util_filter.h:298: error: expected declaration
specifiers or âEURO~…âEURO™ before âEURO~apr_read_type_eâEURO™
/usr/include/httpd/util_filter.h:299: error: expected declaration
specifiers or âEURO~…âEURO™ before âEURO~apr_off_tâEURO™
/usr/include/httpd/util_filter.h:299: error: âEURO~ap_get_brigadeâEURO™
declared as function returning a function
/usr/include/httpd/util_filter.h:310: error: expected declaration
specifiers or âEURO~…âEURO™ before âEURO~apr_bucket_brigadeâEURO™
/usr/include/httpd/util_filter.h:310: error: âEURO~ap_pass_brigadeâEURO™
declared as function returning a function
/usr/include/httpd/util_filter.h:348: error: expected declaration
specifiers or âEURO~…âEURO™ before âEURO~ap_out_filter_funcâEURO™
/usr/include/httpd/util_filter.h:374: error: expected declaration
specifiers or âEURO~…âEURO™ before âEURO~ap_out_filter_funcâEURO™
/usr/include/httpd/util_filter.h:492: error: expected declaration
specifiers or âEURO~…âEURO™ before âEURO~apr_bucket_brigadeâEURO™
/usr/include/httpd/util_filter.h:493: error: expected declaration
specifiers or âEURO~…âEURO™ before âEURO~apr_bucket_brigadeâEURO™
/usr/include/httpd/util_filter.h:493: error: expected declaration
specifiers or âEURO~…âEURO™ before âEURO~apr_pool_tâEURO™
/usr/include/httpd/util_filter.h:493: error: âEURO~ap_save_brigadeâEURO™
declared as function returning a function
/usr/include/httpd/util_filter.h:503: error: expected âEURO~)âEURO™
before â
EURO~*âEURO™ token
/usr/include/httpd/util_filter.h:511: error: expected declaration
specifiers or âEURO~…âEURO™ before âEURO~apr_bucket_brigadeâEURO™
/usr/include/httpd/util_filter.h:511: error: âEURO~ap_fflushâEURO™
declared
as function returning a function
/usr/include/httpd/util_filter.h:548: error: expected declaration
specifiers or âEURO~…âEURO™ before âEURO~apr_bucket_brigadeâEURO™
/usr/include/httpd/util_filter.h:549: error: âEURO~ap_fputstrsâEURO™
declared as function returning a function
/usr/include/httpd/util_filter.h:559: error: expected declaration
specifiers or âEURO~…âEURO™ before âEURO~apr_bucket_brigadeâEURO™
/usr/include/httpd/util_filter.h:562: error: âEURO~ap_fprintfâEURO™
declared
as function returning a function
/usr/include/httpd/util_filter.h:562: error: format string argument
not a string type
In file included from mod_ruby.h:54,
from mod_ruby.c:33:
/usr/include/httpd/http_core.h:208: error: expected âEURO~)âEURO™ before
â
EURO~*âEURO™ token
/usr/include/httpd/http_core.h:222: error: expected âEURO~=âEURO™,
âEURO~,âEURO™, â
EURO~;âEURO™, âEURO~asmâEURO™ or âEURO~__attribute__âEURO™ before
âEURO~ap_get_server_portâ
EURO™
/usr/include/httpd/http_core.h:229: error: expected âEURO~=âEURO™,
âEURO~,âEURO™, â
EURO~;âEURO™, âEURO~asmâEURO™ or âEURO~__attribute__âEURO™ before â
EURO~ap_get_limit_req_bodyâEURO™
/usr/include/httpd/http_core.h:278: error: expected specifier-
qualifier-list before âEURO~apr_int64_tâEURO™
/usr/include/httpd/http_core.h:314: error: expected âEURO~=âEURO™,
âEURO~,âEURO™, â
EURO~;âEURO™, âEURO~asmâEURO™ or âEURO~__attribute__âEURO™ before
âEURO~*âEURO™ token
/usr/include/httpd/http_core.h:633: error: expected specifier-
qualifier-list before âEURO~apr_hash_tâEURO™
/usr/include/httpd/http_core.h:662: error: expected âEURO~)âEURO™ before
â
EURO~intâEURO™
/usr/include/httpd/http_core.h:680: error: expected declaration
specifiers or âEURO~…âEURO™ before âEURO~ap_ident_lookupâEURO™
/usr/include/httpd/http_core.h:681: error: expected declaration
specifiers or âEURO~…âEURO™ before âEURO~(âEURO™ token
/usr/include/httpd/http_core.h:681: warning: data definition has no
type or storage class
/usr/include/httpd/http_core.h:681: warning: type defaults to âEURO~intâ
EURO™ in declaration of âEURO~APR_DECLARE_OPTIONAL_FNâEURO™
In file included from mod_ruby.h:55,
from mod_ruby.c:33:
/usr/include/httpd/http_log.h:33:29: error: apr_thread_proc.h: No such
file or directory
In file included from mod_ruby.h:55,
from mod_ruby.c:33:
/usr/include/httpd/http_log.h:102: error: expected âEURO~)âEURO™ before
âEURO~*â
EURO™ token
/usr/include/httpd/http_log.h:109: error: expected âEURO~)âEURO™ before
âEURO~*â
EURO™ token
/usr/include/httpd/http_log.h:121: error: expected âEURO~)âEURO™ before
âEURO~*â
EURO™ token
/usr/include/httpd/http_log.h:196: error: expected declaration
specifiers or âEURO~…âEURO™ before âEURO~apr_pool_tâEURO™
/usr/include/httpd/http_log.h:198: error: format string argument not a
string type
/usr/include/httpd/http_log.h:261: error: expected âEURO~)âEURO™ before
âEURO~*â
EURO™ token
/usr/include/httpd/http_log.h:269: error: expected âEURO~)âEURO™ before
âEURO~*â
EURO™ token
/usr/include/httpd/http_log.h:282: error: expected specifier-qualifier-
list before âEURO~apr_pool_tâEURO™
/usr/include/httpd/http_log.h:301: error: expected âEURO~)âEURO™ before
âEURO~*â
EURO™ token
/usr/include/httpd/http_log.h:335: error: expected âEURO~)âEURO™ before â
EURO~voidâEURO™
In file included from mod_ruby.h:56,
from mod_ruby.c:33:
/usr/include/httpd/http_main.h:49: error: expected âEURO~=âEURO™,
âEURO~,âEURO™, â
EURO~;âEURO™, âEURO~asmâEURO™ or âEURO~__attribute__âEURO™ before
âEURO~*âEURO™ token
/usr/include/httpd/http_main.h:52: error: expected âEURO~=âEURO™,
âEURO~,âEURO™, â
EURO~;âEURO™, âEURO~asmâEURO™ or âEURO~__attribute__âEURO™ before
âEURO~*âEURO™ token
/usr/include/httpd/http_main.h:55: error: expected âEURO~=âEURO™,
âEURO~,âEURO™, â
EURO~;âEURO™, âEURO~asmâEURO™ or âEURO~__attribute__âEURO™ before
âEURO~*âEURO™ token
/usr/include/httpd/http_main.h:64: error: expected declaration
specifiers or âEURO~…âEURO™ before âEURO~ap_signal_serverâEURO™
/usr/include/httpd/http_main.h:64: error: expected declaration
specifiers or âEURO~…âEURO™ before âEURO~(âEURO™ token
/usr/include/httpd/http_main.h:64: warning: data definition has no
type or storage class
/usr/include/httpd/http_main.h:64: warning: type defaults to
âEURO~intâEURO™
in declaration of âEURO~APR_DECLARE_OPTIONAL_FNâEURO™
/usr/include/httpd/http_main.h:64: error: conflicting types for â
EURO~APR_DECLARE_OPTIONAL_FNâEURO™
/usr/include/httpd/http_core.h:681: error: previous declaration of â
EURO~APR_DECLARE_OPTIONAL_FNâEURO™ was here
In file included from mod_ruby.h:57,
from mod_ruby.c:33:
/usr/include/httpd/http_protocol.h:31:26: error: apr_portable.h: No
such file or directory
/usr/include/httpd/http_protocol.h:32:22: error: apr_mmap.h: No such
file or directory
In file included from mod_ruby.h:57,
from mod_ruby.c:33:
/usr/include/httpd/http_protocol.h:45: error: expected âEURO~)âEURO™
before â
EURO~voidâEURO™
/usr/include/httpd/http_protocol.h:77: error: expected declaration
specifiers or âEURO~…âEURO™ before âEURO~apr_bucket_brigadeâEURO™
/usr/include/httpd/http_protocol.h:111: error: expected declaration
specifiers or âEURO~…âEURO™ before âEURO~apr_off_tâEURO™
/usr/include/httpd/http_protocol.h:127: error: expected âEURO~=âEURO™,
âEURO~,â
EURO™, âEURO~;âEURO™, âEURO~asmâEURO™ or âEURO~__attribute__âEURO™
before â
EURO~ap_rationalize_mtimeâEURO™
/usr/include/httpd/http_protocol.h:203: error: expected âEURO~)âEURO™
before
âEURO~*âEURO™ token
/usr/include/httpd/http_protocol.h:228: error: expected âEURO~)âEURO™
before
âEURO~*âEURO™ token
/usr/include/httpd/http_protocol.h:235: error: expected âEURO~)âEURO™
before
âEURO~*âEURO™ token
/usr/include/httpd/http_protocol.h:253: error: expected âEURO~)âEURO™
before
âEURO~*âEURO™ token
/usr/include/httpd/http_protocol.h:426: error: expected declaration
specifiers or âEURO~…âEURO™ before âEURO~apr_size_tâEURO™
/usr/include/httpd/http_protocol.h:534: error: expected declaration
specifiers or âEURO~…âEURO™ before âEURO~apr_size_tâEURO™
/usr/include/httpd/http_protocol.h:535: error: expected declaration
specifiers or âEURO~…âEURO™ before âEURO~apr_size_tâEURO™
/usr/include/httpd/http_protocol.h:537: error: expected declaration
specifiers or âEURO~…âEURO™ before âEURO~apr_bucket_brigadeâEURO™
/usr/include/httpd/http_protocol.h:537: error:
âEURO~ap_rgetline_coreâEURO™
declared as function returning a function
/usr/include/httpd/http_protocol.h:554: error: expected âEURO~)âEURO™
before
âEURO~*âEURO™ token
/usr/include/httpd/http_protocol.h:569: error: expected âEURO~)âEURO™
before
âEURO~intâEURO™
/usr/include/httpd/http_protocol.h:608: error: expected specifier-
qualifier-list before âEURO~apr_bucket_refcountâEURO™
/usr/include/httpd/http_protocol.h:616: error: expected âEURO~=âEURO™,
âEURO~,â
EURO™, âEURO~;âEURO™, âEURO~asmâEURO™ or âEURO~__attribute__âEURO™
before â
EURO~ap_bucket_type_errorâEURO™
/usr/include/httpd/http_protocol.h:633: error: expected âEURO~=âEURO™,
âEURO~,â
EURO™, âEURO~;âEURO™, âEURO~asmâEURO™ or âEURO~__attribute__âEURO™
before âEURO~*âEURO™ token
/usr/include/httpd/http_protocol.h:644: error: expected âEURO~=âEURO™,
âEURO~,â
EURO™, âEURO~;âEURO™, âEURO~asmâEURO™ or âEURO~__attribute__âEURO™
before âEURO~*âEURO™ token
/usr/include/httpd/http_protocol.h:648: error: expected declaration
specifiers or âEURO~…âEURO™ before âEURO~apr_bucket_brigadeâEURO™
/usr/include/httpd/http_protocol.h:648: error: âEURO~ap_byterange_filterâ
EURO™ declared as function returning a function
/usr/include/httpd/http_protocol.h:649: error: expected declaration
specifiers or âEURO~…âEURO™ before âEURO~apr_bucket_brigadeâEURO™
/usr/include/httpd/http_protocol.h:649: error: â
EURO~ap_http_header_filterâEURO™ declared as function returning a
function
/usr/include/httpd/http_protocol.h:651: error: expected declaration
specifiers or âEURO~…âEURO™ before âEURO~apr_bucket_brigadeâEURO™
/usr/include/httpd/http_protocol.h:651: error: â
EURO~ap_content_length_filterâEURO™ declared as function returning a
function
/usr/include/httpd/http_protocol.h:652: error: expected declaration
specifiers or âEURO~…âEURO™ before âEURO~apr_bucket_brigadeâEURO™
/usr/include/httpd/http_protocol.h:652: error: âEURO~ap_old_write_filterâ
EURO™ declared as function returning a function
In file included from mod_ruby.h:58,
from mod_ruby.c:33:
/usr/include/httpd/http_request.h:105: warning: type defaults to â
EURO~intâEURO™ in declaration of âEURO~apr_finfo_tâEURO™
/usr/include/httpd/http_request.h:105: error: expected âEURO~;âEURO™,
âEURO~,â
EURO™ or âEURO~)âEURO™ before âEURO~*âEURO™ token
/usr/include/httpd/http_request.h:131: error: expected declaration
specifiers or âEURO~…âEURO™ before âEURO~apr_bucket_brigadeâEURO™
/usr/include/httpd/http_request.h:131: error: â
EURO~ap_sub_req_output_filterâEURO™ declared as function returning a
function
/usr/include/httpd/http_request.h:198: error: expected declaration
specifiers or âEURO~…âEURO™ before âEURO~apr_time_tâEURO™
/usr/include/httpd/http_request.h:261: error: expected âEURO~)âEURO™
before â
EURO~intâEURO™
In file included from mod_ruby.h:59,
from mod_ruby.c:33:
/usr/include/httpd/util_script.h:51: error: expected âEURO~)âEURO™ before
â
EURO~*âEURO™ token
/usr/include/httpd/util_script.h:90: error: expected declaration
specifiers or âEURO~…âEURO™ before âEURO~apr_file_tâEURO™
/usr/include/httpd/util_script.h:104: error: expected declaration
specifiers or âEURO~…âEURO™ before âEURO~apr_bucket_brigadeâEURO™
In file included from mod_ruby.c:33:
mod_ruby.h:80:21: error: apr_lib.h: No such file or directory
mod_ruby.h:81:23: error: apr_pools.h: No such file or directory
mod_ruby.h:82:25: error: apr_strings.h: No such file or directory
mod_ruby.h:83:24: error: apr_tables.h: No such file or directory
In file included from mod_ruby.c:33:
mod_ruby.h:87: error: expected âEURO~=âEURO™, âEURO~,âEURO™, âEURO~;âEURO™,
âEURO~asmâEURO™ or
âEURO~__attribute__âEURO™ before âEURO~poolâEURO™
mod_ruby.h:88: error: expected âEURO~=âEURO™, âEURO~,âEURO™, âEURO~;âEURO™,
âEURO~asmâEURO™ or
âEURO~__attribute__âEURO™ before âEURO~array_headerâEURO™
mod_ruby.h:89: error: expected âEURO~=âEURO™, âEURO~,âEURO™, âEURO~;âEURO™,
âEURO~asmâEURO™ or
âEURO~__attribute__âEURO™ before âEURO~tableâEURO™
mod_ruby.h:90: error: expected âEURO~=âEURO™, âEURO~,âEURO™, âEURO~;âEURO™,
âEURO~asmâEURO™ or
âEURO~__attribute__âEURO™ before âEURO~table_entryâEURO™
In file included from mod_ruby.h:165,
from mod_ruby.c:33:
apache_request.h:32: error: expected specifier-qualifier-list before â
EURO~tableâEURO™
apache_request.h:50: error: expected specifier-qualifier-list before â
EURO~tableâEURO™
apache_request.h:90: error: expected âEURO~=âEURO™, âEURO~,âEURO™,
âEURO~;âEURO™, âEURO~asmâ
EURO™ or âEURO~__attribute__âEURO™ before âEURO~*âEURO™ token
apache_request.h:95: error: expected âEURO~=âEURO™, âEURO~,âEURO™,
âEURO~;âEURO™, âEURO~asmâ
EURO™ or âEURO~__attribute__âEURO™ before âEURO~*âEURO™ token
apache_request.h:96: error: expected âEURO~=âEURO™, âEURO~,âEURO™,
âEURO~;âEURO™, âEURO~asmâ
EURO™ or âEURO~__attribute__âEURO™ before âEURO~*âEURO™ token
apache_request.h:123: error: expected âEURO~)âEURO™ before âEURO~*âEURO™
token
In file included from mod_ruby.h:166,
from mod_ruby.c:33:
apache_multipart_buffer.h:48: error: expected âEURO~=âEURO™,
âEURO~,âEURO™, âEURO~;â
EURO™, âEURO~asmâEURO™ or âEURO~__attribute__âEURO™ before âEURO~*âEURO™
token
In file included from mod_ruby.h:167,
from mod_ruby.c:33:
apache_cookie.h:23: error: expected âEURO~=âEURO™, âEURO~,âEURO™,
âEURO~;âEURO™, âEURO~asmâ
EURO™ or âEURO~__attribute__âEURO™ before âEURO~ApacheCookieJarâEURO™
apache_cookie.h:28: error: expected specifier-qualifier-list before â
EURO~array_headerâEURO™
apache_cookie.h:83: error: expected âEURO~=âEURO™, âEURO~,âEURO™,
âEURO~;âEURO™, âEURO~asmâ
EURO™ or âEURO~__attribute__âEURO™ before âEURO~*âEURO™ token
In file included from mod_ruby.c:33:
mod_ruby.h:173: error: expected specifier-qualifier-list before â
EURO~array_headerâEURO™
mod_ruby.h:182: error: expected specifier-qualifier-list before â
EURO~tableâEURO™
mod_ruby.h:209: error: expected specifier-qualifier-list before â
EURO~tableâEURO™
mod_ruby.h:235: error: expected âEURO~=âEURO™, âEURO~,âEURO™,
âEURO~;âEURO™, âEURO~asmâEURO™
or âEURO~__attribute__âEURO™ before âEURO~*âEURO™ token
In file included from mod_ruby.c:34:
ruby_config.h:33: error: expected âEURO~)âEURO™ before âEURO~*âEURO™ token
ruby_config.h:34: error: expected âEURO~)âEURO™ before âEURO~*âEURO™ token
ruby_config.h:35: error: expected âEURO~)âEURO™ before âEURO~*âEURO™ token
ruby_config.h:36: error: expected âEURO~)âEURO™ before âEURO~*âEURO™ token
In file included from mod_ruby.c:35:
apachelib.h:49: error: expected âEURO~)âEURO™ before âEURO~*âEURO™ token
apachelib.h:55: error: expected âEURO~)âEURO™ before âEURO~*âEURO™ token
apachelib.h:95: error: expected âEURO~)âEURO™ before âEURO~*âEURO™ token
mod_ruby.c:106: error: expected âEURO~=âEURO™, âEURO~,âEURO™,
âEURO~;âEURO™, âEURO~asmâEURO™
or âEURO~__attribute__âEURO™ before âEURO~*âEURO™ token
mod_ruby.c:221: error: expected âEURO~)âEURO™ before âEURO~*âEURO™ token
mod_ruby.c:222: error: expected âEURO~)âEURO™ before âEURO~*âEURO™ token
mod_ruby.c:224: error: expected âEURO~)âEURO™ before âEURO~*âEURO™ token
mod_ruby.c:244: error: âEURO~ruby_create_dir_configâEURO™ undeclared here
(not in a function)
mod_ruby.c:244: warning: excess elements in struct initializer
mod_ruby.c:244: warning: (near initialization for
âEURO~ruby_moduleâEURO™)
mod_ruby.c:245: error: âEURO~ruby_merge_dir_configâEURO™ undeclared here
(not in a function)
mod_ruby.c:245: warning: excess elements in struct initializer
mod_ruby.c:245: warning: (near initialization for
âEURO~ruby_moduleâEURO™)
mod_ruby.c:246: error: âEURO~ruby_create_server_configâEURO™ undeclared
here
(not in a function)
mod_ruby.c:246: warning: excess elements in struct initializer
mod_ruby.c:246: warning: (near initialization for
âEURO~ruby_moduleâEURO™)
mod_ruby.c:247: error: âEURO~ruby_merge_server_configâEURO™ undeclared
here
(not in a function)
mod_ruby.c:247: warning: excess elements in struct initializer
mod_ruby.c:247: warning: (near initialization for
âEURO~ruby_moduleâEURO™)
mod_ruby.c:248: warning: excess elements in struct initializer
mod_ruby.c:248: warning: (near initialization for
âEURO~ruby_moduleâEURO™)
mod_ruby.c:249: error: âEURO~ruby_register_hooksâEURO™ undeclared here
(not
in a function)
mod_ruby.c:250: warning: excess elements in struct initializer
mod_ruby.c:250: warning: (near initialization for
âEURO~ruby_moduleâEURO™)
mod_ruby.c: In function âEURO~handle_errorâEURO™:
mod_ruby.c:527: error: âEURO~request_recâEURO™ has no member named â
EURO~request_configâEURO™
mod_ruby.c:528: error: âEURO~request_recâEURO™ has no member named â
EURO~request_configâEURO™
mod_ruby.c:529: error: âEURO~ruby_request_configâEURO™ has no member
named â
EURO~request_objectâEURO™
mod_ruby.c:530: error: âEURO~ruby_request_configâEURO™ has no member
named â
EURO~request_objectâEURO™
mod_ruby.c:533: error: âEURO~request_recâEURO™ has no member named
âEURO~serverâ
EURO™
mod_ruby.c: In function âEURO~mod_ruby_setup_loadpathâEURO™:
mod_ruby.c:551: error: âEURO~ruby_server_configâEURO™ has no member named
â
EURO~load_pathâEURO™
mod_ruby.c:552: error: âEURO~ruby_server_configâEURO™ has no member named
â
EURO~load_pathâEURO™
mod_ruby.c:553: error: âEURO~ruby_server_configâEURO™ has no member named
â
EURO~load_pathâEURO™
mod_ruby.c:558: error: âEURO~ruby_dir_configâEURO™ has no member named â
EURO~load_pathâEURO™
mod_ruby.c:559: error: âEURO~ruby_dir_configâEURO™ has no member named â
EURO~load_pathâEURO™
mod_ruby.c:560: error: âEURO~ruby_dir_configâEURO™ has no member named â
EURO~load_pathâEURO™
mod_ruby.c: At top level:
mod_ruby.c:592: error: expected âEURO~)âEURO™ before âEURO~*âEURO™ token
mod_ruby.c: In function âEURO~ruby_init_interpreterâEURO™:
mod_ruby.c:635: error: âEURO~server_recâEURO™ has no member named â
EURO~module_configâEURO™
mod_ruby.c:692: error: âEURO~ruby_server_configâEURO™ has no member named
â
EURO~load_pathâEURO™
mod_ruby.c:693: error: âEURO~ruby_server_configâEURO™ has no member named
â
EURO~load_pathâEURO™
mod_ruby.c:697: error: âEURO~ruby_server_configâEURO™ has no member named
â
EURO~load_pathâEURO™
mod_ruby.c:701: error: âEURO~ruby_required_librariesâEURO™ undeclared
(first
use in this function)
mod_ruby.c:701: error: (Each undeclared identifier is reported only
once
mod_ruby.c:701: error: for each function it appears in.)
mod_ruby.c: At top level:
mod_ruby.c:814: error: âEURO~ruby_child_cleanupâEURO™ declared as
function
returning a function
mod_ruby.c: In function âEURO~ruby_child_cleanupâEURO™:
mod_ruby.c:836: error: âEURO~APR_SUCCESSâEURO™ undeclared (first use in
this
function)
mod_ruby.c: At top level:
mod_ruby.c:842: error: expected declaration specifiers or âEURO~…âEURO™
before âEURO~poolâEURO™
mod_ruby.c: In function âEURO~fake_request_recâEURO™:
mod_ruby.c:844: warning: implicit declaration of function â
EURO~apr_pcallocâEURO™
mod_ruby.c:844: error: âEURO~pâEURO™ undeclared (first use in this
function)
mod_ruby.c:845: error: âEURO~request_recâEURO™ has no member named
âEURO~poolâ
EURO™
mod_ruby.c:846: error: âEURO~request_recâEURO™ has no member named
âEURO~serverâ
EURO™
mod_ruby.c:847: error: âEURO~request_recâEURO™ has no member named â
EURO~per_dir_configâEURO™
mod_ruby.c:848: error: âEURO~request_recâEURO™ has no member named â
EURO~request_configâEURO™
mod_ruby.c:849: error: âEURO~request_recâEURO™ has no member named
âEURO~uriâEURO™
mod_ruby.c:850: error: âEURO~request_recâEURO™ has no member named
âEURO~notesâ
EURO™
mod_ruby.c: At top level:
mod_ruby.c:854: error: expected declaration specifiers or âEURO~…âEURO™
before âEURO~array_headerâEURO™
mod_ruby.c:857: error: expected âEURO~)âEURO™ before âEURO~*âEURO™ token
mod_ruby.c:923: error: expected âEURO~)âEURO™ before âEURO~*âEURO™ token
mod_ruby.c:957: error: expected âEURO~)âEURO™ before âEURO~*âEURO™ token
mod_ruby.c: In function âEURO~rb_setup_cgi_envâEURO™:
mod_ruby.c:974: error: âEURO~request_recâEURO™ has no member named
âEURO~serverâ
EURO™
mod_ruby.c:975: error: âEURO~request_recâEURO™ has no member named â
EURO~per_dir_configâEURO™
mod_ruby.c:975: error: âEURO~request_recâEURO™ has no member named â
EURO~per_dir_configâEURO™
mod_ruby.c:977: warning: implicit declaration of function â
EURO~mod_ruby_clearenvâEURO™
mod_ruby.c:977: error: âEURO~request_recâEURO™ has no member named
âEURO~poolâ
EURO™
mod_ruby.c:980: warning: implicit declaration of function â
EURO~setenv_from_tableâEURO™
mod_ruby.c:980: error: âEURO~request_recâEURO™ has no member named â
EURO~subprocess_envâEURO™
mod_ruby.c:981: error: âEURO~ruby_server_configâEURO™ has no member named
â
EURO~envâEURO™
mod_ruby.c:982: error: âEURO~ruby_dir_configâEURO™ has no member named â
EURO~envâEURO™
mod_ruby.c: At top level:
mod_ruby.c:1076: error: expected âEURO~=âEURO™, âEURO~,âEURO™,
âEURO~;âEURO™, âEURO~asmâEURO™
or âEURO~__attribute__âEURO™ before âEURO~*âEURO™ token
mod_ruby.c:1095: error: expected âEURO~)âEURO™ before âEURO~*âEURO™ token
mod_ruby.c: In function âEURO~per_request_initâEURO™:
mod_ruby.c:1117: error: âEURO~request_recâEURO™ has no member named â
EURO~request_configâEURO™
mod_ruby.c:1118: warning: implicit declaration of function â
EURO~apr_pallocâEURO™
mod_ruby.c:1118: error: âEURO~request_recâEURO™ has no member named
âEURO~poolâ
EURO™
mod_ruby.c:1118: warning: assignment makes pointer from integer
without a cast
mod_ruby.c:1119: error: âEURO~ruby_request_configâEURO™ has no member
named â
EURO~saved_envâEURO™
mod_ruby.c:1119: warning: implicit declaration of function âEURO~save_envâ
EURO™
mod_ruby.c:1119: error: âEURO~request_recâEURO™ has no member named
âEURO~poolâ
EURO™
mod_ruby.c:1120: error: âEURO~ruby_request_configâEURO™ has no member
named â
EURO~request_objectâEURO™
mod_ruby.c:1121: error: âEURO~request_recâEURO™ has no member named â
EURO~request_configâEURO™
mod_ruby.c:1123: error: âEURO~request_recâEURO™ has no member named â
EURO~per_dir_configâEURO™
mod_ruby.c:1123: error: âEURO~request_recâEURO™ has no member named â
EURO~per_dir_configâEURO™
mod_ruby.c:1124: error: âEURO~request_recâEURO™ has no member named â
EURO~serverâEURO™
mod_ruby.c:1135: error: âEURO~request_recâEURO™ has no member named â
EURO~filenameâEURO™
mod_ruby.c:1136: error: âEURO~request_recâEURO™ has no member named â
EURO~filenameâEURO™
mod_ruby.c: In function âEURO~per_request_cleanupâEURO™:
mod_ruby.c:1147: error: âEURO~request_recâEURO™ has no member named â
EURO~per_dir_configâEURO™
mod_ruby.c:1147: error: âEURO~request_recâEURO™ has no member named â
EURO~per_dir_configâEURO™
mod_ruby.c:1150: error: âEURO~request_recâEURO™ has no member named
âEURO~nextâ
EURO™
mod_ruby.c:1151: error: âEURO~request_recâEURO™ has no member named
âEURO~nextâ
EURO™
mod_ruby.c:1159: error: âEURO~request_recâEURO™ has no member named
âEURO~mainâ
EURO™
mod_ruby.c:1160: error: âEURO~request_recâEURO™ has no member named
âEURO~mainâ
EURO™
mod_ruby.c:1174: error: âEURO~request_recâEURO™ has no member named â
EURO~request_configâEURO™
mod_ruby.c:1175: error: âEURO~request_recâEURO™ has no member named â
EURO~request_configâEURO™
mod_ruby.c:1177: warning: implicit declaration of function â
EURO~restore_envâEURO™
mod_ruby.c:1177: error: âEURO~request_recâEURO™ has no member named
âEURO~poolâ
EURO™
mod_ruby.c:1177: error: âEURO~ruby_request_configâEURO™ has no member
named â
EURO~saved_envâEURO™
mod_ruby.c:1180: error: âEURO~ruby_dir_configâEURO™ has no member named â
EURO~gc_per_requestâEURO™
mod_ruby.c: In function âEURO~ruby_handler_0âEURO™:
mod_ruby.c:1215: error: âEURO~request_recâEURO™ has no member named â
EURO~serverâEURO™
mod_ruby.c: At top level:
mod_ruby.c:1224: error: expected specifier-qualifier-list before â
EURO~array_headerâEURO™
mod_ruby.c: In function âEURO~ruby_handler_internalâEURO™:
mod_ruby.c:1234: error: âEURO~array_headerâEURO™ undeclared (first use in
this function)
mod_ruby.c:1234: error: âEURO~handlers_arrâEURO™ undeclared (first use in
this function)
mod_ruby.c:1234: error: âEURO~handler_internal_arg_tâEURO™ has no member
named âEURO~handlers_arrâEURO™
mod_ruby.c:1235: error: âEURO~handler_internal_arg_tâEURO™ has no member
named âEURO~midâEURO™
mod_ruby.c:1236: error: âEURO~handler_internal_arg_tâEURO™ has no member
named âEURO~run_allâEURO™
mod_ruby.c:1237: error: âEURO~handler_internal_arg_tâEURO™ has no member
named âEURO~flushâEURO™
mod_ruby.c:1251: error: âEURO~request_recâEURO™ has no member named â
EURO~serverâEURO™
mod_ruby.c:1252: error: âEURO~request_recâEURO™ has no member named â
EURO~per_dir_configâEURO™
mod_ruby.c:1252: error: âEURO~request_recâEURO™ has no member named â
EURO~per_dir_configâEURO™
mod_ruby.c:1253: error: âEURO~ruby_dir_configâEURO™ has no member named â
EURO~safe_levelâEURO™
mod_ruby.c:1256: error: âEURO~handler_internal_arg_tâEURO™ has no member
named âEURO~retvalâEURO™
mod_ruby.c:1264: error: âEURO~ruby_server_configâEURO™ has no member
named â
EURO~timeoutâEURO™
mod_ruby.c:1277: error: âEURO~handler_internal_arg_tâEURO™ has no member
named âEURO~retvalâEURO™
mod_ruby.c:1281: error: âEURO~handler_internal_arg_tâEURO™ has no member
named âEURO~retvalâEURO™
mod_ruby.c:1284: error: âEURO~handler_internal_arg_tâEURO™ has no member
named âEURO~retvalâEURO™
mod_ruby.c:1284: error: âEURO~handler_internal_arg_tâEURO™ has no member
named âEURO~retvalâEURO™
mod_ruby.c:1287: error: âEURO~handler_internal_arg_tâEURO™ has no member
named âEURO~retvalâEURO™
mod_ruby.c: At top level:
mod_ruby.c:1292: error: expected declaration specifiers or
âEURO~…âEURO™
before âEURO~array_headerâEURO™
mod_ruby.c: In function âEURO~ruby_handlerâEURO™:
mod_ruby.c:1297: error: âEURO~handlers_arrâEURO™ undeclared (first use in
this function)
mod_ruby.c:1300: error: âEURO~request_recâEURO™ has no member named
âEURO~poolâ
EURO™
mod_ruby.c:1300: warning: assignment makes pointer from integer
without a cast
mod_ruby.c:1302: error: âEURO~handler_internal_arg_tâEURO™ has no member
named âEURO~handlers_arrâEURO™
mod_ruby.c:1303: error: âEURO~handler_internal_arg_tâEURO™ has no member
named âEURO~midâEURO™
mod_ruby.c:1304: error: âEURO~handler_internal_arg_tâEURO™ has no member
named âEURO~run_allâEURO™
mod_ruby.c:1305: error: âEURO~handler_internal_arg_tâEURO™ has no member
named âEURO~flushâEURO™
mod_ruby.c:1306: error: âEURO~handler_internal_arg_tâEURO™ has no member
named âEURO~retvalâEURO™
mod_ruby.c:1329: error: âEURO~handler_internal_arg_tâEURO™ has no member
named âEURO~retvalâEURO™
mod_ruby.c: In function âEURO~ruby_object_handlerâEURO™:
mod_ruby.c:1338: error: âEURO~request_recâEURO™ has no member named â
EURO~handlerâEURO™
mod_ruby.c:1338: error: âEURO~request_recâEURO™ has no member named â
EURO~handlerâEURO™
mod_ruby.c:1338: error: âEURO~request_recâEURO™ has no member named â
EURO~handlerâEURO™
mod_ruby.c:1338: error: âEURO~request_recâEURO™ has no member named â
EURO~handlerâEURO™
mod_ruby.c:1338: error: âEURO~request_recâEURO™ has no member named â
EURO~handlerâEURO™
mod_ruby.c:1338: error: âEURO~request_recâEURO™ has no member named â
EURO~handlerâEURO™
mod_ruby.c:1338: error: âEURO~request_recâEURO™ has no member named â
EURO~handlerâEURO™
mod_ruby.c:1338: error: âEURO~request_recâEURO™ has no member named â
EURO~handlerâEURO™
mod_ruby.c:1338: error: âEURO~request_recâEURO™ has no member named â
EURO~handlerâEURO™
mod_ruby.c:1338: error: âEURO~request_recâEURO™ has no member named â
EURO~handlerâEURO™
mod_ruby.c:1338: error: âEURO~request_recâEURO™ has no member named â
EURO~handlerâEURO™
mod_ruby.c:1338: error: âEURO~request_recâEURO™ has no member named â
EURO~handlerâEURO™
mod_ruby.c:1338: error: âEURO~request_recâEURO™ has no member named â
EURO~handlerâEURO™
mod_ruby.c:1338: error: âEURO~request_recâEURO™ has no member named â
EURO~handlerâEURO™
mod_ruby.c:1338: error: âEURO~request_recâEURO™ has no member named â
EURO~handlerâEURO™
mod_ruby.c:1338: error: âEURO~request_recâEURO™ has no member named â
EURO~handlerâEURO™
mod_ruby.c:1338: error: âEURO~request_recâEURO™ has no member named â
EURO~handlerâEURO™
mod_ruby.c:1338: error: âEURO~request_recâEURO™ has no member named â
EURO~handlerâEURO™
mod_ruby.c:1338: error: âEURO~request_recâEURO™ has no member named â
EURO~handlerâEURO™
mod_ruby.c:1338: error: âEURO~request_recâEURO™ has no member named â
EURO~handlerâEURO™
mod_ruby.c:1342: error: âEURO~request_recâEURO™ has no member named â
EURO~per_dir_configâEURO™
mod_ruby.c:1342: error: âEURO~request_recâEURO™ has no member named â
EURO~per_dir_configâEURO™
mod_ruby.c:1343: error: âEURO~ruby_dir_configâEURO™ has no member named â
EURO~ruby_handlerâEURO™
mod_ruby.c:1343: error: too many arguments to function âEURO~ruby_handlerâ
EURO™
mod_ruby.c:1345: error: âEURO~request_recâEURO™ has no member named
âEURO~finfoâ
EURO™
mod_ruby.c:1345: error: âEURO~APR_DIRâEURO™ undeclared (first use in this
function)
mod_ruby.c:1346: error: âEURO~request_recâEURO™ has no member named â
EURO~handlerâEURO™
mod_ruby.c: In function âEURO~ruby_trans_handlerâEURO™:
mod_ruby.c:1353: error: âEURO~request_recâEURO™ has no member named â
EURO~per_dir_configâEURO™
mod_ruby.c:1353: error: âEURO~request_recâEURO™ has no member named â
EURO~per_dir_configâEURO™
mod_ruby.c:1355: error: âEURO~ruby_dir_configâEURO™ has no member named â
EURO~ruby_trans_handlerâEURO™
mod_ruby.c:1356: error: too many arguments to function âEURO~ruby_handlerâ
EURO™
mod_ruby.c: In function âEURO~ruby_authen_handlerâEURO™:
mod_ruby.c:1361: error: âEURO~request_recâEURO™ has no member named â
EURO~per_dir_configâEURO™
mod_ruby.c:1361: error: âEURO~request_recâEURO™ has no member named â
EURO~per_dir_configâEURO™
mod_ruby.c:1364: error: âEURO~ruby_dir_configâEURO™ has no member named â
EURO~ruby_authen_handlerâEURO™
mod_ruby.c:1365: error: âEURO~ruby_dir_configâEURO™ has no member named â
EURO~ruby_authen_handlerâEURO™
mod_ruby.c:1366: error: too many arguments to function âEURO~ruby_handlerâ
EURO™
mod_ruby.c: In function âEURO~ruby_authz_handlerâEURO™:
mod_ruby.c:1372: error: âEURO~request_recâEURO™ has no member named â
EURO~per_dir_configâEURO™
mod_ruby.c:1372: error: âEURO~request_recâEURO™ has no member named â
EURO~per_dir_configâEURO™
mod_ruby.c:1374: error: âEURO~ruby_dir_configâEURO™ has no member named â
EURO~ruby_authz_handlerâEURO™
mod_ruby.c:1375: error: too many arguments to function âEURO~ruby_handlerâ
EURO™
mod_ruby.c: In function âEURO~ruby_access_handlerâEURO™:
mod_ruby.c:1380: error: âEURO~request_recâEURO™ has no member named â
EURO~per_dir_configâEURO™
mod_ruby.c:1380: error: âEURO~request_recâEURO™ has no member named â
EURO~per_dir_configâEURO™
mod_ruby.c:1382: error: âEURO~ruby_dir_configâEURO™ has no member named â
EURO~ruby_access_handlerâEURO™
mod_ruby.c:1383: error: too many arguments to function âEURO~ruby_handlerâ
EURO™
mod_ruby.c: In function âEURO~ruby_type_handlerâEURO™:
mod_ruby.c:1388: error: âEURO~request_recâEURO™ has no member named â
EURO~per_dir_configâEURO™
mod_ruby.c:1388: error: âEURO~request_recâEURO™ has no member named â
EURO~per_dir_configâEURO™
mod_ruby.c:1390: error: âEURO~ruby_dir_configâEURO™ has no member named â
EURO~ruby_type_handlerâEURO™
mod_ruby.c:1391: error: âEURO~ruby_dir_configâEURO™ has no member named â
EURO~ruby_type_handlerâEURO™
mod_ruby.c:1392: error: too many arguments to function âEURO~ruby_handlerâ
EURO™
mod_ruby.c: In function âEURO~ruby_fixup_handlerâEURO™:
mod_ruby.c:1397: error: âEURO~request_recâEURO™ has no member named â
EURO~per_dir_configâEURO™
mod_ruby.c:1397: error: âEURO~request_recâEURO™ has no member named â
EURO~per_dir_configâEURO™
mod_ruby.c:1399: error: âEURO~ruby_dir_configâEURO™ has no member named â
EURO~ruby_fixup_handlerâEURO™
mod_ruby.c:1400: error: âEURO~ruby_dir_configâEURO™ has no member named â
EURO~ruby_fixup_handlerâEURO™
mod_ruby.c:1401: error: too many arguments to function âEURO~ruby_handlerâ
EURO™
mod_ruby.c: In function âEURO~ruby_log_handlerâEURO™:
mod_ruby.c:1406: error: âEURO~request_recâEURO™ has no member named â
EURO~per_dir_configâEURO™
mod_ruby.c:1406: error: âEURO~request_recâEURO™ has no member named â
EURO~per_dir_configâEURO™
mod_ruby.c:1408: error: âEURO~ruby_dir_configâEURO™ has no member named â
EURO~ruby_log_handlerâEURO™
mod_ruby.c:1409: error: âEURO~ruby_dir_configâEURO™ has no member named â
EURO~ruby_log_handlerâEURO™
mod_ruby.c:1410: error: too many arguments to function âEURO~ruby_handlerâ
EURO™
mod_ruby.c: At top level:
mod_ruby.c:1433: error: âEURO~ruby_cleanup_handlerâEURO™ declared as
function returning a function
mod_ruby.c: In function âEURO~ruby_cleanup_handlerâEURO™:
mod_ruby.c:1435: error: âEURO~request_recâEURO™ has no member named â
EURO~per_dir_configâEURO™
mod_ruby.c:1435: error: âEURO~request_recâEURO™ has no member named â
EURO~per_dir_configâEURO™
mod_ruby.c:1437: error: âEURO~ruby_dir_configâEURO™ has no member named â
EURO~ruby_cleanup_handlerâEURO™
mod_ruby.c:1438: error: too many arguments to function âEURO~ruby_handlerâ
EURO™
mod_ruby.c:1439: error: âEURO~APR_SUCCESSâEURO™ undeclared (first use in
this function)
mod_ruby.c: In function âEURO~ruby_post_read_request_handlerâEURO™:
mod_ruby.c:1444: error: âEURO~request_recâEURO™ has no member named â
EURO~per_dir_configâEURO™
mod_ruby.c:1444: error: âEURO~request_recâEURO™ has no member named â
EURO~per_dir_configâEURO™
mod_ruby.c:1447: warning: implicit declaration of function â
EURO~apr_pool_cleanup_registerâEURO™
mod_ruby.c:1447: error: âEURO~request_recâEURO™ has no member named
âEURO~poolâ
EURO™
mod_ruby.c:1448: error: âEURO~apr_pool_cleanup_nullâEURO™ undeclared
(first
use in this function)
mod_ruby.c:1450: error: âEURO~ruby_dir_configâEURO™ has no member named â
EURO~ruby_init_handlerâEURO™
mod_ruby.c:1451: error: âEURO~ruby_dir_configâEURO™ has no member named â
EURO~ruby_init_handlerâEURO™
mod_ruby.c:1452: error: too many arguments to function âEURO~ruby_handlerâ
EURO™
mod_ruby.c:1453: warning: implicit declaration of function â
EURO~apr_table_setâEURO™
mod_ruby.c:1453: error: âEURO~request_recâEURO™ has no member named
âEURO~notesâ
EURO™
mod_ruby.c:1457: error: âEURO~ruby_dir_configâEURO™ has no member named â
EURO~ruby_post_read_request_handlerâEURO™
mod_ruby.c:1458: error: too many arguments to function âEURO~ruby_handlerâ
EURO™
make: *** [mod_ruby.o] Error 1

This forum is not affiliated to the Ruby language, Ruby on Rails framework, nor any Ruby applications discussed here.

| Privacy Policy | Terms of Service | Remote Ruby Jobs