Problem installing gnuradio and op25 using pybombs

i`m trying to install op25 using pybombs and i faced some errors,
here is the script.

[ 30%] Built target pygen_gr_digital_swig_2165f
Scanning dependencies of target pygen_gr_atsc_swig_1e8f8
[ 30%] Generating atsc_swig.tag
[ 30%] [ 30%] Building CXX object
gnuradio-runtime/lib/CMakeFiles/gnuradio-runtime.dir/controlport/rpcserver_ice.cc.o
Swig source
[ 30%] Generating atsc_swig.pyc
[ 31%] Generating atsc_swig.pyo
[ 31%] Built target pygen_gr_atsc_swig_1e8f8
Scanning dependencies of target pygen_gr_audio_swig_6b25d
[ 31%] Generating audio_swig.tag
[ 31%] Swig source
In file included from
/usr/local/include/boost/fusion/mpl/detail/clear.hpp:12:0,
from /usr/local/include/boost/fusion/mpl/clear.hpp:12,
from /usr/local/include/boost/fusion/mpl.hpp:17,
from
/usr/local/include/boost/fusion/view/detail/strictest_traversal.hpp:15,
from
/usr/local/include/boost/fusion/view/transform_view/transform_view.hpp:20,
from
/usr/local/include/boost/fusion/algorithm/transformation/transform.hpp:10,
from
/usr/local/include/boost/fusion/include/transform.hpp:10,
from /usr/local/include/boost/proto/fusion.hpp:24,
from /usr/local/include/boost/proto/core.hpp:21,
from
/usr/local/include/boost/xpressive/regex_primitives.hpp:28,
from
/usr/local/include/boost/xpressive/xpressive_static.hpp:24,
from
/usr/local/include/boost/xpressive/xpressive.hpp:18,
from
/home/islam/pybombs/src/gnuradio/volk/lib/qa_utils.cc:6:
/usr/local/include/boost/fusion/container/map/map_fwd.hpp:18:64: fatal
error: boost/fusion/container/map/detail/cpp03/map_fwd.hpp: No such file
or directoryIn file included from
/usr/local/include/boost/fusion/mpl/detail/clear.hpp:12:0,
from /usr/local/include/boost/fusion/mpl/clear.hpp:12,
from /usr/local/include/boost/fusion/mpl.hpp:17,
from
/usr/local/include/boost/fusion/view/detail/strictest_traversal.hpp:15,
from
/usr/local/include/boost/fusion/view/transform_view/transform_view.hpp:20,
from
/usr/local/include/boost/fusion/algorithm/transformation/transform.hpp:10,
from
/usr/local/include/boost/fusion/include/transform.hpp:10,
from /usr/local/include/boost/proto/fusion.hpp:24,
from /usr/local/include/boost/proto/core.hpp:21,
from
/usr/local/include/boost/xpressive/regex_primitives.hpp:28,
from
/usr/local/include/boost/xpressive/xpressive_static.hpp:24,
from
/usr/local/include/boost/xpressive/xpressive.hpp:18,
from
/home/islam/pybombs/src/gnuradio/gnuradio-runtime/lib/controlport/rpcserver_ice.cc:30:
/usr/local/include/boost/fusion/container/map/map_fwd.hpp:18:64: fatal
error: boost/fusion/container/map/detail/cpp03/map_fwd.hpp: No such file
or directoryIn file included from
/usr/local/include/boost/fusion/mpl/detail/clear.hpp:12:0,
from /usr/local/include/boost/fusion/mpl/clear.hpp:12,
from /usr/local/include/boost/fusion/mpl.hpp:17,
from
/usr/local/include/boost/fusion/view/detail/strictest_traversal.hpp:15,
from
/usr/local/include/boost/fusion/view/transform_view/transform_view.hpp:20,
from
/usr/local/include/boost/fusion/algorithm/transformation/transform.hpp:10,
from
/usr/local/include/boost/fusion/include/transform.hpp:10,
from /usr/local/include/boost/proto/fusion.hpp:24,
from /usr/local/include/boost/proto/core.hpp:21,
from
/usr/local/include/boost/xpressive/regex_primitives.hpp:28,
from
/usr/local/include/boost/xpressive/xpressive_static.hpp:24,
from
/usr/local/include/boost/xpressive/xpressive.hpp:18,
from

/home/islam/pybombs/src/gnuradio/volk/lib/qa_utils.cc:6:
/usr/local/include/boost/fusion/container/map/map_fwd.hpp:18:64: fatal
error: boost/fusion/container/map/detail/cpp03/map_fwd.hpp: No such file
or directory
compilation terminated.

compilation terminated.

compilation terminated.
[ 31%] Generating audio_swig.pyc
[ 31%] Generating audio_swig.pyo
[ 31%] Built target pygen_gr_audio_swig_6b25d
Scanning dependencies of target pygen_gr_channels_swig_cc61a
[ 31%] Generating channels_swig.tag
[ 31%] Swig source
make[2]: *** [volk/lib/CMakeFiles/test_all.dir/qa_utils.cc.o] Error 1
make[1]: *** [volk/lib/CMakeFiles/test_all.dir/all] Error 2
make[1]: *** Waiting for unfinished jobs…
make[2]: ***
[volk/apps/CMakeFiles/volk_profile.dir/__/lib/qa_utils.cc.o] Error 1
make[1]: *** [volk/apps/CMakeFiles/volk_profile.dir/all] Error 2
make[2]: ***
[gnuradio-runtime/lib/CMakeFiles/gnuradio-runtime.dir/controlport/rpcserver_ice.cc.o]
Error 1
make[1]: *** [gnuradio-runtime/lib/CMakeFiles/gnuradio-runtime.dir/all]
Error 2
[ 31%] [ 31%] Generating channels_swig.pyc
Generating channels_swig.pyo
[ 31%] Built target pygen_gr_channels_swig_cc61a
make: *** [all] Error 2
ERROR:root:PyBOMBS Make step failed for package (gnuradio) please see
bash output above for a reason (hint: look for the word Error)
[email protected]:~/pybombs$ ^C

This forum is not affiliated to the Ruby language, Ruby on Rails framework, nor any Ruby applications discussed here.

| Privacy Policy | Terms of Service | Remote Ruby Jobs