-Lprefix/lib

Issue #8443 has been updated by nagachika (Tomoyuki C.).

なかださん

バックポートしようと思ったのですが LIBRUBY_PATHFLAGS への代入が ruby_2_0_0 では -L$(libdir)
になっていたので(r39347 がバックポートされていないため)、conflict を解消して以下のようなパッチにしてみました。
-L$(libdir) → -L${libprefix} に変更してもいいでしょうか?

Index: configure.in

— configure.in (revision 42911)
+++ configure.in (working copy)
@@ -2816,7 +2816,8 @@ AS_CASE("$enable_shared", [yes], [
])
if test “$enable_rpath” = yes; then
test -z “$LIBRUBY_RPATHFLAGS” ||
LIBRUBY_RPATHFLAGS="$LIBRUBY_RPATHFLAGS "

  • LIBRUBY_RPATHFLAGS="$LIBRUBY_RPATHFLAGS${linker_flag}-R
    ${linker_flag}${libprefix} -L$(libdir)"
  • LIBRUBY_RPATHFLAGS="$LIBRUBY_RPATHFLAGS${linker_flag}-R
    ${linker_flag}${libprefix}"
  • test “x$cross_compiling” = xyes ||
    LIBRUBY_RPATHFLAGS="$LIBRUBY_RPATHFLAGS -L${libprefix}"
    LIBRUBYARG_SHARED="$LIBRUBY_RPATHFLAGS $LIBRUBYARG_SHARED"
    LIBRUBYARG_STATIC="$LIBRUBY_RPATHFLAGS $LIBRUBYARG_STATIC"
    fi

Bug #8443: -Lprefix/lib
https://bugs.ruby-lang.org/issues/8443#change-41750

Author: akr (Akira T.)
Status: Closed
Priority: Normal
Assignee: nobu (Nobuyoshi N.)
Category: build
Target version:
ruby -v: 2.1.0
Backport: 1.9.3: REQUIRED, 2.0.0: REQUIRED

最近試しているクロスコンパイルな CI で、
思い立って DESTDIR を使って気がついたんですが、
configure に --prefix=/usr と指定すると、
/usr にあるライブラリを使ってしまうことがあるようです。

クロスコンパイルなので、ビルド環境の /usr は使ってほしくないんですが、
どうでしょうか。

実際に問題が出た環境は buildroot で作った i386 環境と、
Android (x86) の環境です。
ビルド環境 (x86_64) と中途半端に似ていると問題が起きやすいようです。

まず i386 は
http://www.rubyist.net/~akr/chkbuild/debian/crossruby-trunk-i386/log/20130522T080000Z.diff.html.gz
というように、curses のところで -ltermcap が見つからないというエラーになっています。

compiling curses.c
linking shared-object curses.so
/extdisk/chkbuild/buildroot/i386/buildroot-2013.02/output/host/usr/lib/gcc/i586-buildroot-linux-uclibc/4.6.3/…/…/…/…/i586-buildroot-linux-uclibc/bin/ld:
cannot find -ltermcap

ext/curses/mkmf.log をみると以下のように -ltermcap は見つかっています。
(改行を入れてあります)

have_library: checking for tgetent() in -ltermcap…
-------------------- yes

“i586-buildroot-linux-uclibc-gcc -o conftest
-I…/…/.ext/include/i586-linux-uclibc -I…/…/./include
-I…/…/./ext/curses
-O3 -fno-fast-math
-ggdb3
-Wall -Wextra -Wno-unused-parameter -Wno-parentheses -Wno-long-long
-Wno-missing-field-initializers -Wunused-variable -Wpointer-arith
-Wwrite-strings -Wdeclaration-after-statement
-Wimplicit-function-declaration
conftest.c
-L. -L…/… -L.
-rdynamic -Wl,-export-dynamic -Wl,-R -Wl,/usr/lib -L/usr/lib
-lruby-static -ltermcap -lpthread -ldl -lcrypt -lm -lc”
conftest.c: In function ‘t’:
conftest.c:13:57: error: ‘tgetent’ undeclared (first use in this
function)
conftest.c:13:57: note: each undeclared identifier is reported only
once for each function it appears in
conftest.c:13:32: warning: variable ‘p’ set but not used
[-Wunused-but-set-variable]
checked program was:
/* begin */
1: #include “ruby.h”
2:
3: /top/
4: extern int t(void);
5: int main(int argc, char *argv)
6: {
7: if (argc > 1000000) {
8: printf("%p", &t);
9: }
10:
11: return 0;
12: }
13: int t(void) { void ((volatile p)()); p = (void (()()))tgetent;
return 0; }
/
end */

それに対し、make -n で実際のコマンドを調べて実行すると、リンクできません。

% i586-buildroot-linux-uclibc-gcc -shared
-o …/…/.ext/i586-linux-uclibc/curses.so curses.o
-L. -L…/… -L. -rdynamic -Wl,-export-dynamic
-lncurses -ltermcap -lpthread -ldl -lcrypt -lm -lc
/extdisk/chkbuild/buildroot/i386/buildroot-2013.02/output/host/usr/lib/gcc/i586-buildroot-linux-uclibc/4.6.3/…/…/…/…/i586-buildroot-linux-uclibc/bin/ld:
cannot find -ltermcap
collect2: ld returned 1 exit status

比較すると、mkmf.log には -L/usr/lib があるので
試しに足してみるとリンクできますが、それはおそらく間違いでしょう。

また、Android (x86) では、
http://www.rubyist.net/~akr/chkbuild/debian/crossruby-trunk-x86android/log/20130522T093235Z.diff.html.gz
というように ruby のリンクのところで失敗しています。

linking ruby
/extdisk/chkbuild/android/x86/bin/…/sysroot/usr/lib/crtbegin_dynamic.o(.text+0x19):
error: undefined reference to ‘__libc_init’
eval_error.c:8: error: undefined reference to ‘__stack_chk_guard’
file.c:1023: error: undefined reference to ‘__stack_chk_guard’
file.c:1066: error: undefined reference to ‘__stack_chk_guard’
以下略

make -n で調べると失敗するコマンドラインは以下のようになっています。

i686-linux-android-gcc -O3 -fno-fast-math -ggdb3
-Wall -Wextra -Wno-unused-parameter -Wno-parentheses -Wno-long-long

-Wno-missing-field-initializers -Wunused-variable
-Werror=pointer-arith
-Werror=write-strings -Werror=declaration-after-statement
-Werror=implicit-function-declaration
-ansi -std=iso9899:199409
-L. -fstack-protector -rdynamic -Wl,-export-dynamic
-fstack-protector -pie
main.o
-Wl,-R -Wl,/usr/lib -L/usr/lib
-lruby-static -ldl -lm
-o ruby

この場合、-L/usr/lib を削るとリンクに成功します。

-Lprefix/lib というのは、少なくともクロスコンパイルでは間違いだと思うんですが、
どうですかねぇ。

[田中 哲][たなか あきら][Tanaka A.]

This forum is not affiliated to the Ruby language, Ruby on Rails framework, nor any Ruby applications discussed here.

| Privacy Policy | Terms of Service | Remote Ruby Jobs