Installing GNURadio Using build script

Hello Everyone,
When I try to install GNURadio using the build script provided
the build-gnuradio script

I get the following error.
[ 47%] Building CXX object
gr-filter/lib/CMakeFiles/test-gr-filter.dir/qa_firdes.cc.o[ 47%]
Building CXX object
gr-filter/lib/CMakeFiles/test-gr-filter.dir/qa_fir_filter_with_buffer.cc.o[
47%] Building CXX object
gr-filter/lib/CMakeFiles/test-gr-filter.dir/qa_mmse_fir_interpolator_cc.cc.o[
47%] Building CXX object
gr-filter/lib/CMakeFiles/test-gr-filter.dir/qa_mmse_fir_interpolator_ff.cc.oLinking
CXX executable test-gr-filter[ 47%] Built target test-gr-filterScanning
dependencies of target _gr_filter_swig_doc_tag[ 47%] Building CXX object
gr-filter/swig/CMakeFiles/_gr_filter_swig_doc_tag.dir/_gr_filter_swig_doc_tag.cpp.oLinking
CXX executable _gr_filter_swig_doc_tag[ 47%] Built target
_gr_filter_swig_doc_tagScanning dependencies of target
filter_swig_swig_doc[ 47%] Generating doxygen xml for gr_filter_swig_doc
docs[ 47%] Generating python docstrings for gr_filter_swig_doc[ 47%]
Built target filter_swig_swig_docScanning dependencies of target
_filter_swig_swig_tag[ 47%] Building CXX object
gr-filter/swig/CMakeFiles/_filter_swig_swig_tag.dir/_filter_swig_swig_tag.cpp.oLinking
CXX executable _filter_swig_swig_tag[ 47%] Built target
_filter_swig_swig_tag[ 47%] Generating filter_swig.tagScanning
dependencies of target filter_swig_gr_filter_swig_2b734[ 47%] Building
CXX object
gr-filter/swig/CMakeFiles/filter_swig_gr_filter_swig_2b734.dir/filter_swig_gr_filter_swig_2b734.cpp.oLinking
CXX executable filter_swig_gr_filter_swig_2b734Swig source[ 47%] Built
target filter_swig_gr_filter_swig_2b734Scanning dependencies of target
_filter_swig[ 47%] Building CXX object
gr-filter/swig/CMakeFiles/_filter_swig.dir/filter_swigPYTHON_wrap.cxx.oc++:
internal compiler error: Killed (program cc1plus)Please submit a full
bug report,with preprocessed source if appropriate.See
<file:///usr/share/doc/gcc-4.8/README.Bugs> for instructions.make[2]:


[gr-filter/swig/CMakeFiles/_filter_swig.dir/filter_swigPYTHON_wrap.cxx.o]
Error 4make[1]: *** [gr-filter/swig/CMakeFiles/_filter_swig.dir/all]
Error 2make: *** [all] Error 2make failedExiting Gnu Radio build/install
=======================================================================If
you have found this script useful and time-saving, consider a donation
to help me keep build-gnuradio, simple_ra, SIDsuite,meteor_detector,
simple_fm_rcv, and multimode maintained and up to date.A simple paypal
transfer to [email protected] is all you need to
do.======================================================================Send
success/fail info to sbrac.org?
I’m running Ubuntu OS (14.04 LTS) on Parallels software on MacBook Air.
Can anyone show how to resolve this error?
ThanksVamsi

On 09/08/2015 02:32 PM, vamsi krishna wrote:

[ 47%] Building CXX object
[ 47%] Building CXX object
Linking CXX executable _filter_swig_swig_tag
gr-filter/swig/CMakeFiles/_filter_swig.dir/filter_swigPYTHON_wrap.cxx.o
Exiting Gnu Radio build/install

Can anyone show how to resolve this error?

Thanks
Vamsi

This is almost certainly due to GCC running out of memory during
compilation of (rather large) SWIG-generated code. Add more memory to
your VM, and/or add swap space.

Hi Marcus,
RAM was the issue. It worked like charm once I increased the RAM size.
Thank you.

 On Tuesday, 8 September 2015 11:36 AM, Marcus D. Leech 

[email protected] wrote:

On 09/08/2015 02:32 PM, vamsi krishna wrote:

Hello Everyone,
When I try to install GNURadio using the build script provided
the build-gnuradio script

I get the following error.
[ 47%] Building CXX object
gr-filter/lib/CMakeFiles/test-gr-filter.dir/qa_firdes.cc.o [ 47%]
Building CXX
objectgr-filter/lib/CMakeFiles/test-gr-filter.dir/qa_fir_filter_with_buffer.cc.o
[ 47%] Building CXX
objectgr-filter/lib/CMakeFiles/test-gr-filter.dir/qa_mmse_fir_interpolator_cc.cc.o
[ 47%] Building CXX
objectgr-filter/lib/CMakeFiles/test-gr-filter.dir/qa_mmse_fir_interpolator_ff.cc.o
Linking CXX executable test-gr-filter [ 47%] Built target test-gr-filter
Scanning dependencies of target _gr_filter_swig_doc_tag [ 47%] Building
CXX
objectgr-filter/swig/CMakeFiles/_gr_filter_swig_doc_tag.dir/_gr_filter_swig_doc_tag.cpp.o
Linking CXX executable _gr_filter_swig_doc_tag [ 47%] Built target
_gr_filter_swig_doc_tag Scanning dependencies of target
filter_swig_swig_doc [ 47%] Generating doxygen xml for
gr_filter_swig_doc docs [ 47%] Generating python docstrings for
gr_filter_swig_doc [ 47%] Built target filter_swig_swig_doc Scanning
dependencies of target _filter_swig_swig_tag [ 47%] Building CXX
objectgr-filter/swig/CMakeFiles/_filter_swig_swig_tag.dir/_filter_swig_swig_tag.cpp.o
Linking CXX executable _filter_swig_swig_tag [ 47%] Built target
_filter_swig_swig_tag [ 47%] Generating filter_swig.tag Scanning
dependencies of target filter_swig_gr_filter_swig_2b734 [ 47%] Building
CXX
objectgr-filter/swig/CMakeFiles/filter_swig_gr_filter_swig_2b734.dir/filter_swig_gr_filter_swig_2b734.cpp.o
Linking CXX executable filter_swig_gr_filter_swig_2b734 Swig source [
47%] Built target filter_swig_gr_filter_swig_2b734 Scanning dependencies
of target _filter_swig [ 47%] Building CXX object
gr-filter/swig/CMakeFiles/_filter_swig.dir/filter_swigPYTHON_wrap.cxx.o
c++: internal compiler error: Killed (program cc1plus) Please submit a
full bug report, with preprocessed source if appropriate. See
<file:///usr/share/doc/gcc-4.8/README.Bugs> for instructions. make[2]:


[gr-filter/swig/CMakeFiles/_filter_swig.dir/filter_swigPYTHON_wrap.cxx.o]
Error 4 make[1]: *** [gr-filter/swig/CMakeFiles/_filter_swig.dir/all]
Error 2 make: *** [all] Error 2 make failed Exiting Gnu Radio
build/install

If you have found this script useful and time-saving, consider a
donation to help me keep build-gnuradio, simple_ra, SIDsuite,
meteor_detector, simple_fm_rcv, and multimode maintained and up to date.
A simple paypal transfer to [email protected] is all you need to do.

Send success/fail info to sbrac.org?
I’m running Ubuntu OS (14.04 LTS) on Parallels software on MacBook
Air.
Can anyone show how to resolve this error?
Thanks Vamsi

This is almost certainly due to GCC running out of memory during
compilation of (rather large) SWIG-generated code. Add more memory to
your VM, and/or add swap space.

This forum is not affiliated to the Ruby language, Ruby on Rails framework, nor any Ruby applications discussed here.

| Privacy Policy | Terms of Service | Remote Ruby Jobs