Fm-rds

An interesting grc application called FM-RDS
http://mmbtools.crc.ca/content/view/45/73/

I wonder if anyone successfully compiled the gr-rds-3.0 ?

I got the following error (any idea what’s wrong in the installation):


[email protected]:~/n210_grc/
fm_rds/gr-rds-3.0svn$ make
make all-recursive
make[1]: Entering directory
/home/jonathan/n210_grc/fm_rds/gr-rds-3.0svn' Making all in config make[2]: Entering directory/home/jonathan/n210_grc/fm_rds/gr-rds-3.0svn/config’
make[2]: Nothing to be done for all'. make[2]: Leaving directory/home/jonathan/n210_grc/fm_rds/gr-rds-3.0svn/config’
Making all in src
make[2]: Entering directory
/home/jonathan/n210_grc/fm_rds/gr-rds-3.0svn/src' Making all in lib make[3]: Entering directory/home/jonathan/n210_grc/fm_rds/gr-rds-3.0svn/src/lib’
make all-am
make[4]: Entering directory
/home/jonathan/n210_grc/fm_rds/gr-rds-3.0svn/src/lib' /bin/bash ../../libtool --tag=CXX --mode=compile g++ -DHAVE_CONFIG_H -I. -I../.. -pthread -I/usr/local/include/gnuradio -I/usr/local/include -I/usr/include/libxml2 -I/usr/include/python2.7 -g -O2 -MT rds.lo -MD -MP -MF .deps/rds.Tpo -c -o rds.lo rds.cc libtool: compile: g++ -DHAVE_CONFIG_H -I. -I../.. -pthread -I/usr/local/include/gnuradio -I/usr/local/include -I/usr/include/libxml2 * -I/usr/include/python2.7* -g -O2 -MT rds.lo -MD -MP -MF .deps/rds.Tpo -c rds.cc -fPIC -DPIC -o .libs/rds.o rds.cc: In function PyObject* _wrap_gr_rds_data_decoder_sptr_basic_block(PyObject*, PyObject*): rds.cc:4386:21: error: class gr_rds_data_decoder has no member named basic_block rds.cc: In function PyObject* _wrap_gr_rds_data_file_sink_sptr_basic_block(PyObject*, PyObject*): rds.cc:4874:21: error: class gr_rds_data_file_sink has no member named basic_block rds.cc: In function PyObject* _wrap_gr_rds_data_block_sptr_basic_block(PyObject*, PyObject*): rds.cc:5357:21: error: class gr_rds_data_block has no member named basic_block rds.cc: In function PyObject* _wrap_gr_rds_data_encoder_sptr_basic_block(PyObject*, PyObject*): rds.cc:5807:21: error: class gr_rds_data_encoder has no member named basic_block rds.cc: In function PyObject* _wrap_gr_rds_rate_enforcer_sptr_basic_block(PyObject*, PyObject*): rds.cc:6269:21: error: class gr_rds_rate_enforcer has no member named basic_block rds.cc: In function PyObject* _wrap_gr_rds_freq_divider_sptr_basic_block(PyObject*, PyObject*): rds.cc:6728:21: error: class gr_rds_freq_divider has no member named basic_block rds.cc: In function PyObject* _wrap_gr_rds_bpsk_demod_sptr_basic_block(PyObject*, PyObject*): rds.cc:7208:21: error: class gr_rds_bpsk_demod has no member named basic_block make[4]: *** [rds.lo] Error 1 make[4]: Leaving directory/home/jonathan/n210_grc/fm_rds/gr-rds-3.0svn/src/lib’
make[3]: *** [all] Error 2
make[3]: Leaving directory
/home/jonathan/n210_grc/fm_rds/gr-rds-3.0svn/src/lib' make[2]: *** [all-recursive] Error 1 make[2]: Leaving directory/home/jonathan/n210_grc/fm_rds/gr-rds-3.0svn/src’
make[1]: *** [all-recursive] Error 1
make[1]: Leaving directory
`/home/jonathan/n210_grc/fm_rds/gr-rds-3.0svn’
make: *** [all] Error 2
[email protected]:~/n210_grc/fm_rds/gr-rds-3.0svn$

This forum is not affiliated to the Ruby language, Ruby on Rails framework, nor any Ruby applications discussed here.

| Privacy Policy | Terms of Service | Remote Ruby Jobs