Build error when making gnuradio 3.2 on Angstrom/OE

Hi, All,

Now I am trying to install GNU Radio 3.2 on Angstrom and Beagleboard,
Philip’s instruction on

‘Configure’ succeed, but ‘make’ failed just at the beginning with the

make all-recursive
make[1]: Entering directory /home/cic/Prj/gnuradio-3.2.2' Making all in config make[2]: Entering directory/home/cic/Prj/gnuradio-3.2.2/config’
make[2]: Nothing to be done for all'. make[2]: Leaving directory/home/cic/Prj/gnuradio-3.2.2/config’
Making all in gruel
make[2]: Entering directory /home/cic/Prj/gnuradio-3.2.2/gruel' Making all in src make[3]: Entering directory/home/cic/Prj/gnuradio-3.2.2/gruel/src’
Making all in include
make[4]: Entering directory
/home/cic/Prj/gnuradio-3.2.2/gruel/src/include' Making all in gruel make[5]: Entering directory/home/cic/Prj/gnuradio-3.2.2/gruel/src/include/gruel’
make all-am
make[6]: Entering directory
/home/cic/Prj/gnuradio-3.2.2/gruel/src/include/gruel' make[6]: Nothing to be done forall-am’.
make[6]: Leaving directory
/home/cic/Prj/gnuradio-3.2.2/gruel/src/include/gruel' make[5]: Leaving directory/home/cic/Prj/gnuradio-3.2.2/gruel/src/include/gruel’
make[5]: Entering directory
/home/cic/Prj/gnuradio-3.2.2/gruel/src/include' make[5]: Nothing to be done forall-am’.
make[5]: Leaving directory
/home/cic/Prj/gnuradio-3.2.2/gruel/src/include' make[4]: Leaving directory/home/cic/Prj/gnuradio-3.2.2/gruel/src/include’
Making all in lib
make[4]: Entering directory /home/cic/Prj/gnuradio-3.2.2/gruel/src/lib' /bin/bash ../../../libtool --tag=CXX --mode=compile g++ -DHAVE_CONFIG_H -I. -I../../.. -DOMNITHREAD_POSIX=1 -I/usr/include -I/home/cic/Prj/gnuradio-3.2.2/gruel/src/include -I/home/cic/Prj/gnuradio-3.2.2/gruel/src/include -Wall -Woverloaded-virtual -march=armv7-a -mtune=cortex-a8 -mfpu=neon -mfloat-abi=softfp -MT realtime.lo -MD -MP -MF .deps/realtime.Tpo -c -o realtime.lo libtool: compile: g++ -DHAVE_CONFIG_H -I. -I../../.. -DOMNITHREAD_POSIX=1 -I/usr/include -I/home/cic/Prj/gnuradio-3.2.2/gruel/src/include -I/home/cic/Prj/gnuradio-3.2.2/gruel/src/include -Wall -Woverloaded-virtual -march=armv7-a -mtune=cortex-a8 -mfpu=neon -mfloat-abi=softfp -MT realtime.lo -MD -MP -MF .deps/realtime.Tpo -c -fPIC -DPIC -o .libs/realtime.o cc1plus: error: Input/output error g++: Internal error: Segmentation fault (program cc1plus) Please submit a full bug report. See <> for instructions. make[4]: *** [realtime.lo] Error 1 make[4]: Leaving directory/home/cic/Prj/gnuradio-3.2.2/gruel/src/lib’
make[3]: *** [all-recursive] Error 1
make[3]: Leaving directory /home/cic/Prj/gnuradio-3.2.2/gruel/src' make[2]: *** [all-recursive] Error 1 make[2]: Leaving directory/home/cic/Prj/gnuradio-3.2.2/gruel’
make[1]: *** [all-recursive] Error 1
make[1]: Leaving directory `/home/cic/Prj/gnuradio-3.2.2’
make: *** [all] Error 2

But I am using the latest g++.4.3.3-r19.1.6 installed by opkg,

what’s the reason of this g++ error, and how to fix it?