Forum: Ruby-dev -Lprefix/lib

Announcement (2017-05-07): is now read-only since I unfortunately do not have the time to support and maintain the forum any more. Please see and for other Rails- und Ruby-related community platforms.
8cbb39dadafaf2287a83a13ee4981ec9?d=identicon&s=25 unknown (Guest)
on 2014-02-17 09:55
(Received via mailing list)
Issue #8443 has been updated by Usaku NAKAMURA.

Backport changed from 1.9.3: REQUIRED, 2.0.0: REQUIRED to 1.9.3:


Bug #8443:  -Lprefix/lib

* Author: Akira Tanaka
* Status: Closed
* Priority: Normal
* Assignee: Nobuyoshi Nakada
* Category: build
* Target version:
* ruby -v: 2.1.0
* Backport: 1.9.3: REJECTED, 2.0.0: REQUIRED
 最近試しているクロスコンパイルな CI で、
 思い立って DESTDIR を使って気がついたんですが、
 configure に --prefix=/usr と指定すると、
 /usr にあるライブラリを使ってしまうことがあるようです。

 クロスコンパイルなので、ビルド環境の /usr は使ってほしくないんですが、

 実際に問題が出た環境は buildroot で作った i386 環境と、
 Android (x86) の環境です。
 ビルド環境 (x86_64) と中途半端に似ていると問題が起きやすいようです。

 まず i386 は
 というように、curses のところで -ltermcap が見つからないというエラーになっています。

 compiling curses.c
 linking shared-object
 cannot find -ltermcap

 ext/curses/mkmf.log をみると以下のように -ltermcap は見つかっています。

 have_library: checking for tgetent() in -ltermcap...
-------------------- yes

 "i586-buildroot-linux-uclibc-gcc -o conftest
  -I../../.ext/include/i586-linux-uclibc -I../.././include
  -O3 -fno-fast-math
  -Wall -Wextra -Wno-unused-parameter -Wno-parentheses -Wno-long-long
  -Wno-missing-field-initializers -Wunused-variable -Wpointer-arith
  -Wwrite-strings -Wdeclaration-after-statement
  -L.  -L../..  -L.
  -rdynamic -Wl,-export-dynamic -Wl,-R -Wl,/usr/lib -L/usr/lib
  -lruby-static -ltermcap  -lpthread -ldl -lcrypt -lm   -lc"
 conftest.c: In function 't':
 conftest.c:13:57: error: 'tgetent' undeclared (first use in this
 conftest.c:13:57: note: each undeclared identifier is reported only
 once for each function it appears in
 conftest.c:13:32: warning: variable 'p' set but not used
 checked program was:
 /* begin */
  1: #include "ruby.h"
  3: /*top*/
  4: extern int t(void);
  5: int main(int argc, char **argv)
  6: {
  7:   if (argc > 1000000) {
  8:     printf("%p", &t);
  9:   }
 11:   return 0;
 12: }
 13: int t(void) { void ((*volatile p)()); p = (void ((*)()))tgetent;
return 0; }
 /* end */

 それに対し、make -n で実際のコマンドを調べて実行すると、リンクできません。

 % i586-buildroot-linux-uclibc-gcc -shared \
 -o ../../.ext/i586-linux-uclibc/ curses.o \
 -L. -L../.. -L.  -rdynamic -Wl,-export-dynamic \
 -lncurses -ltermcap  -lpthread -ldl -lcrypt -lm   -lc
 cannot find -ltermcap
 collect2: ld returned 1 exit status

 比較すると、mkmf.log には -L/usr/lib があるので

 また、Android (x86) では、
 というように ruby のリンクのところで失敗しています。

 linking ruby
 error: undefined reference to '__libc_init'
 eval_error.c:8: error: undefined reference to '__stack_chk_guard'
 file.c:1023: error: undefined reference to '__stack_chk_guard'
 file.c:1066: error: undefined reference to '__stack_chk_guard'

 make -n で調べると失敗するコマンドラインは以下のようになっています。

   i686-linux-android-gcc -O3 -fno-fast-math -ggdb3 \
     -Wall -Wextra -Wno-unused-parameter -Wno-parentheses -Wno-long-long
     -Wno-missing-field-initializers -Wunused-variable
-Werror=pointer-arith \
     -Werror=write-strings -Werror=declaration-after-statement \
     -Werror=implicit-function-declaration \
     -ansi -std=iso9899:199409 \
     -L. -fstack-protector -rdynamic -Wl,-export-dynamic \
     -fstack-protector -pie \
     main.o \
     -Wl,-R -Wl,/usr/lib -L/usr/lib \
     -lruby-static  -ldl -lm \
     -o ruby

 この場合、-L/usr/lib を削るとリンクに成功します。

 -Lprefix/lib というのは、少なくともクロスコンパイルでは間違いだと思うんですが、
 [田中 哲][たなか あきら][Tanaka Akira]
This topic is locked and can not be replied to.