Forum: GNU Radio Fail when "./make check" in Cygwin

Announcement (2017-05-07): is now read-only since I unfortunately do not have the time to support and maintain the forum any more. Please see and for other Rails- und Ruby-related community platforms.
Cf2f6615159d9945d0591aa7eb469957?d=identicon&s=25 Alaelddin Mohammed (Guest)
on 2007-06-18 21:43
(Received via mailing list)
Am using Cygwin. when I did "./make check" I got the following message

FAIL: run_tests
1 of 1 tests failed
make[6]: *** [check-TESTS] Error 1
make[6]: Leaving directory
make[5]: *** [check-am] Error 2
make[5]: Leaving directory
make[4]: *** [check-recursive] Error 1
make[4]: Leaving directory
make[3]: *** [check-recursive] Error 1
make[3]: Leaving directory
make[2]: *** [check-recursive] Error 1
make[2]: Leaving directory `/usr/src/gnuradio-3.0.3/gnuradio-core/src'
make[1]: *** [check-recursive] Error 1
make[1]: Leaving directory `/usr/src/gnuradio-3.0.3/gnuradio-core'
make: *** [check-recursive] Error 1

what shall I do now please

This topic is locked and can not be replied to.