Forum: GNU Radio installation error

Announcement (2017-05-07): www.ruby-forum.com is now read-only since I unfortunately do not have the time to support and maintain the forum any more. Please see rubyonrails.org/community and ruby-lang.org/en/community for other Rails- und Ruby-related community platforms.
bellzii (Guest)
on 2007-03-16 18:02
(Received via mailing list)
hey everyone,
Im using a ubuntu 6.10 ,ive tried compiling the gnuradio but when i
tried
the configuring gnuradio but i got the error :
gr_block.cc:41: error: 'gr_io_signature_sptr' has not been declared
gr_block.cc:42: error: 'gr_io_signature_sptr' has not been declared
gr_block.cc: In constructor 'gr_block::gr_block(const std::string&, int,
int)':
gr_block.cc:44: error: class 'gr_block' does not have any field named
'd_input_signature'
gr_block.cc:45: error: class 'gr_block' does not have any field named
'd_output_signature'
gr_block.cc: In member function 'void gr_block::consume(int, int)':
gr_block.cc:112: error: 'd_detail' was not declared in this scope
gr_block.cc: In member function 'void gr_block::consume_each(int)':
gr_block.cc:118: error: 'd_detail' was not declared in this scope
make[4]: *** [gr_block.lo] Error 1
make[4]: Leaving directory
`/home/ziad/Desktop/gnuradio-3.0.3/gnuradio-core/src/lib/runtime'
make[3]: *** [install-recursive] Error 1
make[3]: Leaving directory
`/home/ziad/Desktop/gnuradio-3.0.3/gnuradio-core/src/lib'
make[2]: *** [install-recursive] Error 1
make[2]: Leaving directory
`/home/ziad/Desktop/gnuradio-3.0.3/gnuradio-core/src'
make[1]: *** [install-recursive] Error 1
make[1]: Leaving directory
`/home/ziad/Desktop/gnuradio-3.0.3/gnuradio-core'
make: *** [install-recursive] Error 1

Can some1 help
thanks for your time
ziad


--
View this message in context:
http://www.nabble.com/installation-error-tf3415350...
Sent from the GnuRadio mailing list archive at Nabble.com.
Eric B. (Guest)
on 2007-03-16 23:07
(Received via mailing list)
On Fri, Mar 16, 2007 at 09:02:17AM -0700, bellzii wrote:
> gr_block.cc:45: error: class 'gr_block' does not have any field named
> `/home/ziad/Desktop/gnuradio-3.0.3/gnuradio-core/src/lib'
> make[2]: *** [install-recursive] Error 1
> make[2]: Leaving directory
> `/home/ziad/Desktop/gnuradio-3.0.3/gnuradio-core/src'
> make[1]: *** [install-recursive] Error 1
> make[1]: Leaving directory `/home/ziad/Desktop/gnuradio-3.0.3/gnuradio-core'
> make: *** [install-recursive] Error 1
>
> Can some1 help
> thanks for your time
> ziad


Did the "configure" step complete successfully?

Eric
bellzii (Guest)
on 2007-03-19 00:52
(Received via mailing list)
yes Eric congiuration and making went well,
but after i made check i got

The following components were skipped either because you asked not
to build them or they didn't pass configuration checks:

gr-audio-jack
gr-audio-osx
gr-audio-portaudio
gr-audio-windows
gr-comedi
gr-video-sdl
ezdop
gr-ezdop

These components will not be built.

(all other critical components were built)

Can you tell me how can i built those missed components

--
View this message in context:
http://www.nabble.com/installation-error-tf3415350...
Sent from the GnuRadio mailing list archive at Nabble.com.
bellzii (Guest)
on 2007-03-19 00:53
(Received via mailing list)
yes Eric congiuration and making went well,
but after i made check i got

The following components were skipped either because you asked not
to build them or they didn't pass configuration checks:

gr-audio-jack
gr-audio-osx
gr-audio-portaudio
gr-audio-windows
gr-comedi
gr-video-sdl
ezdop
gr-ezdop

These components will not be built.

(all other critical components were built)

Can you tell me how can i built those missed components

--
View this message in context:
http://www.nabble.com/installation-error-tf3415350...
Sent from the GnuRadio mailing list archive at Nabble.com.
This topic is locked and can not be replied to.